Reaction Details
TargetTyrosine-protein kinase ABL1
LigandBDBM112312
Substrate/Competitorn/a
Meas. Tech.In Vitro Enzyme Assay
Ki 0.02±n/a nM
Citation Lyssikatos, JPGazzard, LJHanan, EKintz, SPurkey, HE Substituted 6,6-fused nitrogenous heterocyclic compounds and uses thereof US Patent US8623889 Publication Date 1/7/2014
 
Tyrosine-protein kinase ABL1
Name:Tyrosine-protein kinase ABL1
Type:Enzyme
Mol. Mass.:122897.30
Organism:Homo sapiens (Human)
Description:P00519
Residue:1130
BDBM112312
NameBDBM112312
Synonyms:US8623889, 311
TypeSmall organic molecule
Emp. Form.C21H17F4N3O2
Mol. Mass.419.3722
SMILESCc1cc(ncc1-c1ccc2cc(NC(=O)C3C[C@@H]3F)ncc2c1)[C@H](O)C(F)(F)F