Reaction Details
TargetOrexin/Hypocretin receptor type 1
LigandBDBM112668
Substrate/Competitorn/a
Meas. Tech.Radioligand Binding Assay
Ki 190±n/a nM
Citation Coleman, PJFraley, MESchreier, JD Disubstituted azepan orexin receptor antagonists US Patent US8623863 Publication Date 1/7/2014
 
Orexin/Hypocretin receptor type 1
Name:Orexin/Hypocretin receptor type 1
Type:Protein
Mol. Mass.:46817.55
Organism:Rattus norvegicus (Rat)
Description:P56718
Residue:416
BDBM112668
NameBDBM112668
Synonyms:US8623863, 2-11
TypeSmall organic molecule
Emp. Form.C22H24FN5O2
Mol. Mass.409.4567
SMILESCC1CCCC(COc2ccc(F)cn2)CN1C(=O)c1ccccc1-n1nccn1