Reaction Details
TargetOrexin/Hypocretin receptor type 1
LigandBDBM112674
Substrate/Competitorn/a
Meas. Tech.Radioligand Binding Assay
Ki 5.1±n/a nM
Citation Coleman, PJFraley, MESchreier, JD Disubstituted azepan orexin receptor antagonists US Patent US8623863 Publication Date 1/7/2014
 
Orexin/Hypocretin receptor type 1
Name:Orexin/Hypocretin receptor type 1
Type:Protein
Mol. Mass.:46817.55
Organism:Rattus norvegicus (Rat)
Description:P56718
Residue:416
BDBM112674
NameBDBM112674
Synonyms:US8623863, 3-8
TypeSmall organic molecule
Emp. Form.C24H27FN4O3
Mol. Mass.438.4946
SMILESCC1COCC(COc2ccc(F)c(C)c2)CN1C(=O)c1cc(C)ccc1-n1nccn1