Reaction Details
TargetOrexin receptor type 2
LigandBDBM112666
Substrate/Competitorn/a
Meas. Tech.Radioligand Binding Assay
Ki 10±n/a nM
Citation Coleman, PJFraley, MESchreier, JD Disubstituted azepan orexin receptor antagonists US Patent US8623863 Publication Date 1/7/2014
 
Orexin receptor type 2
Name:Orexin receptor type 2
Type:Protein
Mol. Mass.:50710.53
Organism:Homo sapiens (Human)
Description:O43614
Residue:444
BDBM112666
NameBDBM112666
Synonyms:US8623863, 2-9
TypeSmall organic molecule
Emp. Form.C24H27FN4O2
Mol. Mass.422.4952
SMILESCC1CCCC(COc2ccc(F)c(C)c2)CN1C(=O)c1ccccc1-n1nccn1