Reaction Details
TargetOrexin receptor type 2
LigandBDBM112669
Substrate/Competitorn/a
Meas. Tech.Radioligand Binding Assay
Ki 4.2±n/a nM
Citation Coleman, PJFraley, MESchreier, JD Disubstituted azepan orexin receptor antagonists US Patent US8623863 Publication Date 1/7/2014
 
Orexin receptor type 2
Name:Orexin receptor type 2
Type:Protein
Mol. Mass.:50710.53
Organism:Homo sapiens (Human)
Description:O43614
Residue:444
BDBM112669
NameBDBM112669
Synonyms:US8623863, 3-2
TypeSmall organic molecule
Emp. Form.C26H29FN2O2S
Mol. Mass.452.584
SMILESCC1CCCC(COc2ccc(F)c(C)c2)CN1C(=O)c1cc(C)ccc1-c1nccs1