Reaction Details
TargetOrexin receptor type 2
LigandBDBM112671
Substrate/Competitorn/a
Meas. Tech.Radioligand Binding Assay
Ki 13±n/a nM
Citation Coleman, PJFraley, MESchreier, JD Disubstituted azepan orexin receptor antagonists US Patent US8623863 Publication Date 1/7/2014
 
Orexin receptor type 2
Name:Orexin receptor type 2
Type:Protein
Mol. Mass.:50710.53
Organism:Homo sapiens (Human)
Description:O43614
Residue:444
BDBM112671
NameBDBM112671
Synonyms:US8623863, 3-4
TypeSmall organic molecule
Emp. Form.C24H26FN3O3
Mol. Mass.423.4799
SMILESCC1CCCC(COc2ccc(F)cn2)CN1C(=O)c1cc(C)ccc1-c1ncco1