Reaction Details
TargetCannabinoid receptor 1
LigandBDBM113764
Substrate/Competitorn/a
Meas. Tech.CB1 & 2 Binding Assays
pH7.4±n/a
Temperature303.15±n/a K
Ki 3.66e+3± 1.21e+3 nM
Commentsextracted
Citation Chicca, ACaprioglio, DMinassi, APetrucci, VAppendino, GTaglialatela-Scafati, OGertsch, J Functionalization of ß-Caryophyllene Generates Novel Polypharmacology in the Endocannabinoid System. ACS Chem Biol9:1499-507 (2014) 
 
Cannabinoid receptor 1
Name:Cannabinoid receptor 1
Type:G Protein-Coupled Receptor (GPCR)
Mol. Mass.:52868.96
Organism:Homo sapiens (Human)
Description:P21554
Residue:472
BDBM113764
NameBDBM113764
Synonyms:(E)-6-((1R,2R)-3,3-Dimethyl-2-(3-methylbut-3-enyl)cyclobutyl)-N-propylhepta-2,6-dienamide (11a)
TypeSmall organic molecule
Emp. Form.C21H35NO
Mol. Mass.317.5087
SMILESCCCNC(=O)\C=C\CCC(=C)[C@@H]1CC(C)(C)[C@@H]1CCC(C)=C