Reaction Details
TargetCannabinoid receptor 1
LigandBDBM113765
Substrate/Competitorn/a
Meas. Tech.CB1 & 2 Binding Assays
pH7.4±n/a
Temperature303.15±n/a K
Ki 8.64e+3± 2.12e+3 nM
Commentsextracted
Citation Chicca, ACaprioglio, DMinassi, APetrucci, VAppendino, GTaglialatela-Scafati, OGertsch, J Functionalization of ß-Caryophyllene Generates Novel Polypharmacology in the Endocannabinoid System. ACS Chem Biol9:1499-507 (2014) 
 
Cannabinoid receptor 1
Name:Cannabinoid receptor 1
Type:G Protein-Coupled Receptor (GPCR)
Mol. Mass.:52868.96
Organism:Homo sapiens (Human)
Description:P21554
Residue:472
BDBM113765
NameBDBM113765
Synonyms:(E)-N-Allyl-6-((1R,2R)-3,3-dimethyl-2-(3-methylbut-3-enyl)cyclobutyl)hepta-2,6-dienamide (11b)
TypeSmall organic molecule
Emp. Form.C21H33NO
Mol. Mass.315.4928
SMILESCC(=C)CC[C@@H]1[C@@H](CC1(C)C)C(=C)CC\C=C\C(=O)NCC=C