Reaction Details
TargetCannabinoid receptor 1
LigandBDBM113767
Substrate/Competitorn/a
Meas. Tech.CB1 & 2 Binding Assays
pH7.4±n/a
Temperature303.15±n/a K
Ki>1.0e+4±n/a nM
Commentsextracted
Citation Chicca, ACaprioglio, DMinassi, APetrucci, VAppendino, GTaglialatela-Scafati, OGertsch, J Functionalization of ß-Caryophyllene Generates Novel Polypharmacology in the Endocannabinoid System. ACS Chem Biol9:1499-507 (2014) 
 
Cannabinoid receptor 1
Name:Cannabinoid receptor 1
Type:G Protein-Coupled Receptor (GPCR)
Mol. Mass.:52868.96
Organism:Homo sapiens (Human)
Description:P21554
Residue:472
BDBM113767
NameBDBM113767
Synonyms:(E)-6-((1R,2R)-3,3-Dimethyl-2-(3-methylbut-3-enyl)cyclobutyl)-N-(4-hydroxy-3-methoxybenzyl)hepta-2,6-dienamide (11e)
TypeSmall organic molecule
Emp. Form.C26H37NO3
Mol. Mass.411.5769
SMILESCOc1cc(CNC(=O)\C=C\CCC(=C)[C@@H]2CC(C)(C)[C@@H]2CCC(C)=C)ccc1O