Reaction Details
TargetPotassium channel subfamily K member 3
LigandBDBM218340
Substrate/Competitorn/a
Meas. Tech.Activity Assay
Temperature298.15±n/a K
IC50 21±n/a nM
Commentsextracted
Citation Bialy, LLorenz, KWirth, KSteinmeyer, KHessler, G Fused pyrroledicarboxamides and their use as pharmaceuticals US Patent US9884860 Publication Date 2/6/2018
 
Potassium channel subfamily K member 3
Name:Potassium channel subfamily K member 3
Type:Protein
Mol. Mass.:43534.71
Organism:Homo sapiens (Human)
Description:O14649
Residue:394
BDBM218340
NameBDBM218340
Synonyms:US9284333, 16cf | US9884860, Example 16cf
TypeSmall organic molecule
Emp. Form.C22H26F3N3O3S
Mol. Mass.469.52
SMILESCC[C@@H](NC(=O)c1cc(C(=O)N2CCC[C@@H]2C)n2CCOCc12)c1ccc(s1)C(F)(F)F