Reaction Details
TargetPC4 and SFRS1-interacting protein
LigandBDBM51295
Substrate/Competitorn/a
Meas. Tech.TR-FRET-based biochemical high throughput dose response assay to identify inhibitors of HIV-1 LEDGF/p75 DNA Integration
IC50 1359±n/a nM
Citation PubChem, PC TR-FRET-based biochemical high throughput dose response assay to identify inhibitors of HIV-1 LEDGF/p75 DNA Integration PubChem Bioassay(2014)[AID]
 
PC4 and SFRS1-interacting protein
Name:PC4 and SFRS1-interacting protein
Type:Enzyme Catalytic Domain
Mol. Mass.:60120.68
Organism:Homo sapiens (Human)
Description:gi_6708281
Residue:530
BDBM51295
NameBDBM51295
Synonyms:8-Amino-2-thioxo-2,3-dihydro-1H-benzo[g]pteridin-4-one 8-amino-2-thioxo-1H-benzo[g]pteridin-4-one MLS000776691 cid_5417965
TypeSmall organic molecule
Emp. Form.C10H7N5OS
Mol. Mass.245.26
SMILESNc1ccc2nc3c(nc2c1)[nH]c(=S)[nH]c3=O