Reaction Details
TargetPC4 and SFRS1-interacting protein
LigandBDBM61326
Substrate/Competitorn/a
Meas. Tech.TR-FRET-based biochemical high throughput dose response assay to identify inhibitors of HIV-1 LEDGF/p75 DNA Integration
IC50 176.9±n/a nM
Citation PubChem, PC TR-FRET-based biochemical high throughput dose response assay to identify inhibitors of HIV-1 LEDGF/p75 DNA Integration PubChem Bioassay(2014)[AID]
 
PC4 and SFRS1-interacting protein
Name:PC4 and SFRS1-interacting protein
Type:Enzyme Catalytic Domain
Mol. Mass.:60120.68
Organism:Homo sapiens (Human)
Description:gi_6708281
Residue:530
BDBM61326
NameBDBM61326
Synonyms:1-N',2-N'-bis[(E)-(2-hydroxy-4-oxocyclohexa-2,5-dien-1-ylidene)methyl]ethanedihydrazide N'~1~,N'~2~-bis(2,4-dihydroxybenzylidene)ethanedihydrazide N1',N2'-bis[(E)-(2-hydroxy-4-oxo-1-cyclohexa-2,5-dienylidene)methyl]ethanedihydrazide SMR000496526 | cid_6508451
TypeSmall organic molecule
Emp. Form.C16H14N4O6
Mol. Mass.358.3056
SMILESOc1ccc(C=NNC(=O)C(=O)NN=Cc2ccc(O)cc2O)c(O)c1