Reaction Details
TargetPC4 and SFRS1-interacting protein
LigandBDBM31757
Substrate/Competitorn/a
Meas. Tech.TR-FRET-based biochemical high throughput dose response assay to identify inhibitors of HIV-1 LEDGF/p75 DNA Integration
IC50 754.27±n/a nM
Citation PubChem, PC TR-FRET-based biochemical high throughput dose response assay to identify inhibitors of HIV-1 LEDGF/p75 DNA Integration PubChem Bioassay(2014)[AID]
 
PC4 and SFRS1-interacting protein
Name:PC4 and SFRS1-interacting protein
Type:Enzyme Catalytic Domain
Mol. Mass.:60120.68
Organism:Homo sapiens (Human)
Description:gi_6708281
Residue:530
BDBM31757
NameBDBM31757
Synonyms:6-hydroxy-3a,4,5,9b-tetrahydro-3H-cyclopenta[c]quinoline-4-carboxylic acid MLS-0015717.0001 | cid_654089
TypeSmall organic molecule
Emp. Form.C13H13NO3
Mol. Mass.231.2472
SMILESOC(=O)C1Nc2c(O)cccc2C2C=CCC12