Reaction Details
TargetPC4 and SFRS1-interacting protein
LigandBDBM95464
Substrate/Competitorn/a
Meas. Tech.TR-FRET-based biochemical high throughput dose response assay to identify inhibitors of HIV-1 LEDGF/p75 DNA Integration
IC50 996±n/a nM
Citation PubChem, PC TR-FRET-based biochemical high throughput dose response assay to identify inhibitors of HIV-1 LEDGF/p75 DNA Integration PubChem Bioassay(2014)[AID]
 
PC4 and SFRS1-interacting protein
Name:PC4 and SFRS1-interacting protein
Type:Enzyme Catalytic Domain
Mol. Mass.:60120.68
Organism:Homo sapiens (Human)
Description:gi_6708281
Residue:530
BDBM95464
NameBDBM95464
Synonyms:4-[[(4Z)-1-keto-4-(2-thienylsulfonylimino)-2-naphthyl]amino]benzoic acid 4-[[(4Z)-1-oxo-4-thiophen-2-ylsulfonylimino-2-naphthalenyl]amino]benzoic acid MLS000409192 cid_5894846
TypeSmall organic molecule
Emp. Form.C21H14N2O5S2
Mol. Mass.438.476
SMILESOC(=O)c1ccc(NC2=CC(=NS(=O)(=O)c3cccs3)c3ccccc3C2=O)cc1