Reaction Details
TargetLysine-specific histone demethylase 1A
LigandBDBM113731
Substrate/Competitorn/a
Meas. Tech.GST-LSD1 Enzymatic Assays
pH7.5±n/a
IC50 4.674e+4±n/a nM
Commentsextracted
Citation Prusevich, PKalin, JHMing, SABasso, MGivens, JLi, XHu, JTaylor, MSCieniewicz, AMHsiao, PYHuang, RRoberson, HAdejola, NAvery, LBCasero, RATaverna, SDQian, JTackett, AJRatan, RRMcDonald, OGFeinberg, APCole, PA A Selective Phenelzine Analogue Inhibitor of Histone Demethylase LSD1. ACS Chem Biol9:1284-93 (2014) 
 
Lysine-specific histone demethylase 1A
Name:Lysine-specific histone demethylase 1A
Type:Enzyme
Mol. Mass.:92901.01
Organism:Homo sapiens (Human)
Description:O60341
Residue:852
BDBM113731
NameBDBM113731
Synonyms:1-Methyl-2-(3-phenylpropyl)hydrazine dihydrochloride salt (9d)
TypeSmall organic molecule
Emp. Form.C10H16N2
Mol. Mass.164.2474
SMILESCNNCCCc1ccccc1