Reaction Details
TargetLysine-specific histone demethylase 1A
LigandBDBM113741
Substrate/Competitorn/a
Meas. Tech.GST-LSD1 Enzymatic Assays
pH7.5±n/a
Ki 2.6e+2± 58 nM
Commentsextracted
Citation Prusevich, PKalin, JHMing, SABasso, MGivens, JLi, XHu, JTaylor, MSCieniewicz, AMHsiao, PYHuang, RRoberson, HAdejola, NAvery, LBCasero, RATaverna, SDQian, JTackett, AJRatan, RRMcDonald, OGFeinberg, APCole, PA A Selective Phenelzine Analogue Inhibitor of Histone Demethylase LSD1. ACS Chem Biol9:1284-93 (2014) 
 
Lysine-specific histone demethylase 1A
Name:Lysine-specific histone demethylase 1A
Type:Enzyme
Mol. Mass.:92901.01
Organism:Homo sapiens (Human)
Description:O60341
Residue:852
BDBM113741
NameBDBM113741
Synonyms:N-[4-(2-Hydrazinylethyl)phenyl]-3-phenylpropanamide sulfate salt (12c)
TypeSmall organic molecule
Emp. Form.C17H21N3O
Mol. Mass.283.3681
SMILESNNCCc1ccc(NC(=O)CCc2ccccc2)cc1