Reaction Details
TargetLysine-specific histone demethylase 1A
LigandBDBM113742
Substrate/Competitorn/a
Meas. Tech.GST-LSD1 Enzymatic Assays
pH7.5±n/a
Ki 59± 21 nM
Commentsextracted
Citation Prusevich, PKalin, JHMing, SABasso, MGivens, JLi, XHu, JTaylor, MSCieniewicz, AMHsiao, PYHuang, RRoberson, HAdejola, NAvery, LBCasero, RATaverna, SDQian, JTackett, AJRatan, RRMcDonald, OGFeinberg, APCole, PA A Selective Phenelzine Analogue Inhibitor of Histone Demethylase LSD1. ACS Chem Biol9:1284-93 (2014) 
 
Lysine-specific histone demethylase 1A
Name:Lysine-specific histone demethylase 1A
Type:Enzyme
Mol. Mass.:92901.01
Organism:Homo sapiens (Human)
Description:O60341
Residue:852
BDBM113742
NameBDBM113742
Synonyms:N-[4-(2-Hydrazinylethyl)phenyl]-4-phenylbutanamide dihydrochloride salt (12d)
TypeSmall organic molecule
Emp. Form.C18H23N3O
Mol. Mass.297.3947
SMILESNNCCc1ccc(NC(=O)CCCc2ccccc2)cc1