Reaction Details
TargetLysine-specific histone demethylase 1A
LigandBDBM113754
Substrate/Competitorn/a
Meas. Tech.GST-LSD1 Enzymatic Assays
pH7.5±n/a
Ki 2.0e+3± 7.3e+2 nM
Commentsextracted
Citation Prusevich, PKalin, JHMing, SABasso, MGivens, JLi, XHu, JTaylor, MSCieniewicz, AMHsiao, PYHuang, RRoberson, HAdejola, NAvery, LBCasero, RATaverna, SDQian, JTackett, AJRatan, RRMcDonald, OGFeinberg, APCole, PA A Selective Phenelzine Analogue Inhibitor of Histone Demethylase LSD1. ACS Chem Biol9:1284-93 (2014) 
 
Lysine-specific histone demethylase 1A
Name:Lysine-specific histone demethylase 1A
Type:Enzyme
Mol. Mass.:92901.01
Organism:Homo sapiens (Human)
Description:O60341
Residue:852
BDBM113754
NameBDBM113754
Synonyms:N-[4-(2-Hydrazinylethyl)phenyl]-N-methyl-4-phenylbutanamide oxalate salt (12l)
TypeSmall organic molecule
Emp. Form.C19H25N3O
Mol. Mass.311.4213
SMILESCN(C(=O)CCCc1ccccc1)c1ccc(CCNN)cc1