Reaction Details
TargetcAMP and cAMP-inhibited cGMP 3',5'-cyclic phosphodiesterase 10A
LigandBDBM115428
Substrate/Competitorn/a
Meas. Tech.Enzyme Inhibition Assay
Temperature298.15±n/a K
IC50 0.056±n/a nM
Commentsextracted
Citation Allen, JRChen, NFalsey, JRFrohn, MJHarrington, PEHarrington, EHKaller, MRKunz, RKNguyen, TTPickrell, AJReichelt, ARumfelt, SRzasa, RMSham, KSiegmund, ACYao, G Aminopyridine and carboxypyridine compounds as phosphodiesterase 10 inhibitors US Patent US8637500 Publication Date 1/28/2014
 
cAMP and cAMP-inhibited cGMP 3',5'-cyclic phosphodiesterase 10A
Name:cAMP and cAMP-inhibited cGMP 3',5'-cyclic phosphodiesterase 10A
Type:Enzyme
Mol. Mass.:90160.88
Organism:Rattus norvegicus (rat)
Description:PDE10A was generated from the full-length recombinant rat clone transfected into Sf9 cells.
Residue:794
BDBM115428
NameBDBM115428
Synonyms:US8637500, 297
TypeSmall organic molecule
Emp. Form.C24H27N5O3
Mol. Mass.433.5029
SMILESCCOC(=O)N1CCC(CC1)c1nccnc1Oc1ccc(Nc2ccc(C)cn2)cc1