Reaction Details
TargetSerine/threonine-protein kinase mTOR
LigandBDBM116094
Substrate/Competitorn/a
Meas. Tech.mTOR Kinase Activity Assay
IC50 0.73±n/a nM
Citation Schneider, SKessler, Dvan der Veen, LWunberg, T 5-alkynyl-pyrimidines US Patent US8633183 Publication Date 1/21/2014
 
Serine/threonine-protein kinase mTOR
Name:Serine/threonine-protein kinase mTOR
Type:Rapamycin target protein
Mol. Mass.:288917.12
Organism:Homo sapiens (Human)
Description:P42345
Residue:2549
BDBM116094
NameBDBM116094
Synonyms:US8633183, E-243
TypeSmall organic molecule
Emp. Form.C27H25ClFN7O
Mol. Mass.517.985
SMILESCCc1ncnc(-c2cc(F)c(C(=O)N3CCN(CCC#N)CC3)c(Cl)c2)c1C#Cc1ccc(N)nc1