Reaction Details
TargetSerine/threonine-protein kinase mTOR
LigandBDBM116145
Substrate/Competitorn/a
Meas. Tech.mTOR Kinase Activity Assay
IC50 0.58±n/a nM
Citation Schneider, SKessler, Dvan der Veen, LWunberg, T 5-alkynyl-pyrimidines US Patent US8633183 Publication Date 1/21/2014
 
Serine/threonine-protein kinase mTOR
Name:Serine/threonine-protein kinase mTOR
Type:Rapamycin target protein
Mol. Mass.:288917.12
Organism:Homo sapiens (Human)
Description:P42345
Residue:2549
BDBM116145
NameBDBM116145
Synonyms:US8633183, E-299
TypeSmall organic molecule
Emp. Form.C27H28F2N6O2
Mol. Mass.506.547
SMILESCCc1ncnc(-c2cc(F)c(C(=O)N3CCN(CC3)C(C)CO)c(F)c2)c1C#Cc1ccc(N)nc1