Reaction Details
TargetTyrosine-protein kinase JAK2
LigandBDBM116317
Substrate/Competitorn/a
Meas. Tech.JAK2 Inhibition Assay
pH7.2±n/a
Temperature295.15±n/a K
Ki 1.6±n/a nM
Commentsextracted
Citation Blaney, JGibbons, PAHanan, ELyssikatos, JPMagnuson, SRPastor, RRawson, TEZhou, AZhu, B Pyrazolopyrimidine JAK inhibitor compounds and methods US Patent US8637526 Publication Date 1/28/2014
 
Tyrosine-protein kinase JAK2
Name:Tyrosine-protein kinase JAK2
Type:Protein
Mol. Mass.:130684.68
Organism:Homo sapiens (Human)
Description:O60674
Residue:1132
BDBM116317
NameBDBM116317
Synonyms:US8637526, 297
TypeSmall organic molecule
Emp. Form.C21H23N5O2
Mol. Mass.377.4396
SMILESO=C(NC1CCOCC1)c1cnn2ccc(NC3Cc4ccccc4C3)nc12