Reaction Details
TargetTyrosine-protein kinase JAK2
LigandBDBM116318
Substrate/Competitorn/a
Meas. Tech.JAK2 Inhibition Assay
pH7.2±n/a
Temperature295.15±n/a K
Ki 0.8±n/a nM
Commentsextracted
Citation Blaney, JGibbons, PAHanan, ELyssikatos, JPMagnuson, SRPastor, RRawson, TEZhou, AZhu, B Pyrazolopyrimidine JAK inhibitor compounds and methods US Patent US8637526 Publication Date 1/28/2014
 
Tyrosine-protein kinase JAK2
Name:Tyrosine-protein kinase JAK2
Type:Protein
Mol. Mass.:130684.68
Organism:Homo sapiens (Human)
Description:O60674
Residue:1132
BDBM116318
NameBDBM116318
Synonyms:US8637526, 299
TypeSmall organic molecule
Emp. Form.C22H25N5O2
Mol. Mass.391.4662
SMILESO[C@H]1CCC(CC1)NC(=O)c1cnn2ccc(NC3CCc4ccccc34)nc12