Reaction Details
TargetSerine/threonine-protein kinase B-raf [V600E]
LigandBDBM117289
Substrate/Competitorn/a
Meas. Tech.kinase Assay
pH7.5±n/a
IC50 1±n/a nM
Commentsextracted
Citation Mantoulidis, ADahmann, GEttmayer, PKlein, CSteurer, SWaizenegger, IZahn, SK Pyrido [5, 4-D] pyrimidines as cell proliferation inhibitors US Patent US8653087 Publication Date 2/18/2014
 
Serine/threonine-protein kinase B-raf [V600E]
Name:Serine/threonine-protein kinase B-raf [V600E]
Type:n/a
Mol. Mass.:84474.98
Organism:Homo sapiens (Human)
Description:P15056 V600E
Residue:766
BDBM117289
NameBDBM117289
Synonyms:US8653087, I-76
TypeSmall organic molecule
Emp. Form.C30H35F3N10O2
Mol. Mass.624.6599
SMILESCN(C)CCN(C)c1cc(NC(=O)c2ccc(C)c(Nc3ncnc4c(N)nc(nc34)N3CCOCC3)c2)cc(c1)C(F)(F)F