Reaction Details
TargetSerine/threonine-protein kinase B-raf [V600E]
LigandBDBM117412
Substrate/Competitorn/a
Meas. Tech.kinase Assay
pH7.5±n/a
IC50 1±n/a nM
Commentsextracted
Citation Mantoulidis, ADahmann, GEttmayer, PKlein, CSteurer, SWaizenegger, IZahn, SK Pyrido [5, 4-D] pyrimidines as cell proliferation inhibitors US Patent US8653087 Publication Date 2/18/2014
 
Serine/threonine-protein kinase B-raf [V600E]
Name:Serine/threonine-protein kinase B-raf [V600E]
Type:n/a
Mol. Mass.:84474.98
Organism:Homo sapiens (Human)
Description:P15056 V600E
Residue:766
BDBM117412
NameBDBM117412
Synonyms:US8653087, III-319 | US8653087, III-92
TypeSmall organic molecule
Emp. Form.C26H30FN9O3
Mol. Mass.535.5733
SMILESCC(C)(C)c1cc(NC(=O)c2ccc(F)c(Nc3ncnc4cnc(NCCN5CCOCC5)nc34)c2)no1