Reaction Details
TargetSerine/threonine-protein kinase B-raf [V600E]
LigandBDBM117642
Substrate/Competitorn/a
Meas. Tech.kinase Assay
pH7.5±n/a
IC50 1±n/a nM
Commentsextracted
Citation Mantoulidis, ADahmann, GEttmayer, PKlein, CSteurer, SWaizenegger, IZahn, SK Pyrido [5, 4-D] pyrimidines as cell proliferation inhibitors US Patent US8653087 Publication Date 2/18/2014
 
Serine/threonine-protein kinase B-raf [V600E]
Name:Serine/threonine-protein kinase B-raf [V600E]
Type:n/a
Mol. Mass.:84474.98
Organism:Homo sapiens (Human)
Description:P15056 V600E
Residue:766
BDBM117642
NameBDBM117642
Synonyms:US8653087, III-322
TypeSmall organic molecule
Emp. Form.C28H28N8O2
Mol. Mass.508.5743
SMILESCc1ccc(cc1Nc1ncnc2cnc(nc12)N1CCOCC1)C(=O)Nc1cccc(c1)C(C)(C)C#N