Reaction Details
TargetAldehyde dehydrogenase, mitochondrial
LigandBDBM118202
Substrate/Competitorn/a
Meas. Tech.ALDH2 Assay
pH7.4±n/a
IC50 57±n/a nM
Commentsextracted
Citation Graupe, MVenkataramani, CZablocki, J ALDH-2 inhibitors in the treatment of addiction US Patent US8673966 Publication Date 3/18/2014
 
Aldehyde dehydrogenase, mitochondrial
Name:Aldehyde dehydrogenase, mitochondrial
Type:Enzyme
Mol. Mass.:56382.67
Organism:Homo sapiens (Human)
Description:P05091
Residue:517
BDBM118202
NameBDBM118202
Synonyms:US8673966, N-(4-(4-oxo-7-(pyrimidin-5-ylethynyl)-4H- chromen-3-yl)phenyl)methanesulfonamide
Typen/a
Emp. Form.C22H15N3O4S
Mol. Mass.417.437
SMILESCS(=O)(=O)Nc1ccc(cc1)-c1coc2cc(ccc2c1=O)C#Cc1cncnc1