Reaction Details
TargetAldehyde dehydrogenase, mitochondrial
LigandBDBM118221
Substrate/Competitorn/a
Meas. Tech.ALDH2 Assay
pH7.4±n/a
IC50 64±n/a nM
Commentsextracted
Citation Graupe, MVenkataramani, CZablocki, J ALDH-2 inhibitors in the treatment of addiction US Patent US8673966 Publication Date 3/18/2014
 
Aldehyde dehydrogenase, mitochondrial
Name:Aldehyde dehydrogenase, mitochondrial
Type:Enzyme
Mol. Mass.:56382.67
Organism:Homo sapiens (Human)
Description:P05091
Residue:517
BDBM118221
NameBDBM118221
Synonyms:US8673966, N-(4-(7-((1-(3-(dimethylamino)propanoyl)- azetidin-3-yl)ethynyl)-4-oxo-4H-chromen-3-yl)phenyl)methanesulfonamide
Typen/a
Emp. Form.C26H27N3O5S
Mol. Mass.493.575
SMILESCN(C)CCC(=O)N1CC(C1)C#Cc1ccc2c(c1)occ(-c1ccc(NS(C)(=O)=O)cc1)c2=O