Reaction Details
TargetAmine oxidase [flavin-containing] B
LigandBDBM118220
Substrate/Competitorn/a
Meas. Tech.MAO-A and MAO-B Assays
pH7.5±n/a
IC50>130000±n/a nM
Commentsextracted
Citation Graupe, MVenkataramani, CZablocki, J ALDH-2 inhibitors in the treatment of addiction US Patent US8673966 Publication Date 3/18/2014
 
Amine oxidase [flavin-containing] B
Name:Amine oxidase [flavin-containing] B
Type:Protein
Mol. Mass.:58768.76
Organism:Homo sapiens (Human)
Description:P27338
Residue:520
BDBM118220
NameBDBM118220
Synonyms:US8673966, N-(4-(7-((1-(3,3-difluorocyclobutanecarbonyl)- azetidin-3-yl)ethynyl)-4-oxo-4H-chromen-3-yl)phenyl)methanesulfonamide
Typen/a
Emp. Form.C26H22F2N2O5S
Mol. Mass.512.525
SMILESCS(=O)(=O)Nc1ccc(cc1)-c1coc2cc(ccc2c1=O)C#CC1CN(C1)C(=O)C1CC(F)(F)C1