Reaction Details
TargetUDP-N-acetylglucosamine 1-carboxyvinyltransferase 2
LigandBDBM50428795
Substrate/Competitorn/a
IC50 3.9e+3±n/a nM
Citation Hrast, MSosic, ISink, RGobec, S Inhibitors of the peptidoglycan biosynthesis enzymes MurA-F. Bioorg Chem55:2-15 (2014) 
 
UDP-N-acetylglucosamine 1-carboxyvinyltransferase 2
Name:UDP-N-acetylglucosamine 1-carboxyvinyltransferase 2
Type:Protein
Mol. Mass.:45068.88
Organism:Staphylococcus aureus (Firmicutes)
Description:S. aureus MurA
Residue:419
BDBM50428795
NameBDBM50428795
Synonyms:CHEMBL2335230 | MurA inhibitor (compound 7)
TypeSmall organic molecule
Emp. Form.C6H3Br2NO3
Mol. Mass.296.901
SMILES[O-][N+](=O)C(\Br)=C\c1ccc(Br)o1