Reaction Details
TargetUDP-N-acetylenolpyruvoylglucosamine reductase
LigandBDBM119079
Substrate/Competitorn/a
IC50 4.3e+3±n/a nM
Citation Hrast, MSosic, ISink, RGobec, S Inhibitors of the peptidoglycan biosynthesis enzymes MurA-F. Bioorg Chem55:2-15 (2014) 
 
UDP-N-acetylenolpyruvoylglucosamine reductase
Name:UDP-N-acetylenolpyruvoylglucosamine reductase
Type:Protein
Mol. Mass.:33791.48
Organism:Staphylococcus aureus (Firmicutes)
Description:S. aureus MurB
Residue:307
BDBM119079
NameBDBM119079
Synonyms:MurB inhibitor (compound 18)
TypeSmall organic molecule
Emp. Form.C24H17Cl4N3O3
Mol. Mass.537.222
SMILESCC1(CC(=O)Nc2ccc(Cl)cc2Cl)C(=O)N(N(C1=O)c1ccc(Cl)cc1)c1ccc(Cl)cc1