Reaction Details
TargetUDP-N-acetylglucosamine 1-carboxyvinyltransferase
LigandBDBM119079
Substrate/Competitorn/a
IC50 2.16e+4±n/a nM
Citation Hrast, MSosic, ISink, RGobec, S Inhibitors of the peptidoglycan biosynthesis enzymes MurA-F. Bioorg Chem55:2-15 (2014) 
 
UDP-N-acetylglucosamine 1-carboxyvinyltransferase
Name:UDP-N-acetylglucosamine 1-carboxyvinyltransferase
Type:Protein
Mol. Mass.:44814.62
Organism:Escherichia coli K-12 (Enterobacteria)
Description:E. coli MurA
Residue:419
BDBM119079
NameBDBM119079
Synonyms:MurB inhibitor (compound 18)
TypeSmall organic molecule
Emp. Form.C24H17Cl4N3O3
Mol. Mass.537.222
SMILESCC1(CC(=O)Nc2ccc(Cl)cc2Cl)C(=O)N(N(C1=O)c1ccc(Cl)cc1)c1ccc(Cl)cc1