Reaction Details
TargetUDP-N-acetylmuramoylalanine--D-glutamate ligase
LigandBDBM119086
Substrate/Competitorn/a
IC50 3.0e+4±n/a nM
Citation Hrast, MSosic, ISink, RGobec, S Inhibitors of the peptidoglycan biosynthesis enzymes MurA-F. Bioorg Chem55:2-15 (2014) 
 
UDP-N-acetylmuramoylalanine--D-glutamate ligase
Name:UDP-N-acetylmuramoylalanine--D-glutamate ligase
Type:Ligase
Mol. Mass.:46963.02
Organism:Escherichia coli (strain K12)
Description:n/a
Residue:438
BDBM119086
NameBDBM119086
Synonyms:MurC/D inhibitor (compound 25) | MurD inhibitor (compound 35)
TypeSmall organic molecule
Emp. Form.C24H18BrN3O3S
Mol. Mass.508.387
SMILESBrc1cccc(c1)C(=O)Nc1ccc(C=NNS(=O)(=O)c2ccc3ccccc3c2)cc1