Reaction Details
TargetUDP-N-acetylglucosamine 1-carboxyvinyltransferase
LigandBDBM119091
Substrate/Competitorn/a
Ki 3.4e+3±n/a nM
Citation Hrast, MSosic, ISink, RGobec, S Inhibitors of the peptidoglycan biosynthesis enzymes MurA-F. Bioorg Chem55:2-15 (2014) 
 
UDP-N-acetylglucosamine 1-carboxyvinyltransferase
Name:UDP-N-acetylglucosamine 1-carboxyvinyltransferase
Type:Protein
Mol. Mass.:44814.62
Organism:Escherichia coli K-12 (Enterobacteria)
Description:E. coli MurA
Residue:419
BDBM119091
NameBDBM119091
Synonyms:Feglymicin (compound 30)
TypeSmall organic molecule
Emp. Form.C95H97N13O30
Mol. Mass.1900.8558
SMILESCC(C)[C@H](NC(=O)[C@H](NC(=O)[C@H](N)c1ccc(O)cc1)c1cc(O)cc(O)c1)C(=O)N[C@@H](C(=O)N[C@H](C(=O)N[C@@H](C(=O)N[C@H](C(=O)N[C@@H](C(=O)N[C@@H](C(C)C)C(=O)N[C@@H](C(=O)N[C@H](C(=O)N[C@@H](Cc1ccccc1)C(=O)N[C@@H](CC(O)=O)C(O)=O)c1ccc(O)cc1)c1cc(O)cc(O)c1)c1cc(O)cc(O)c1)c1ccc(O)cc1)c1cc(O)cc(O)c1)c1ccc(O)cc1)c1cc(O)cc(O)c1