Reaction Details
TargetUDP-N-acetylmuramoylalanine--D-glutamate ligase
LigandBDBM119097
Substrate/Competitorn/a
IC50<1±0.0 nM
Citation Hrast, MSosic, ISink, RGobec, S Inhibitors of the peptidoglycan biosynthesis enzymes MurA-F. Bioorg Chem55:2-15 (2014) 
 
UDP-N-acetylmuramoylalanine--D-glutamate ligase
Name:UDP-N-acetylmuramoylalanine--D-glutamate ligase
Type:Ligase
Mol. Mass.:46963.02
Organism:Escherichia coli (strain K12)
Description:n/a
Residue:438
BDBM119097
NameBDBM119097
Synonyms:MurD inhibitor (compound 36)
TypeSmall organic molecule
Emp. Form.C28H45N4O24P3
Mol. Mass.914.5906
SMILESC[C@@H](O[C@H]1[C@H](O)[C@@H](CO)OC(OP(O)(=O)OP(O)(=O)OCC2OC(C(O)C2O)n2ccc(=O)[nH]c2=O)[C@@H]1NC(C)=O)C(=O)N[C@H](C)P(O)(=O)CC(CCC(O)=O)C(O)=O