Reaction Details
TargetUDP-N-acetylmuramoylalanine--D-glutamate ligase
LigandBDBM119104
Substrate/Competitorn/a
IC50 3e+3±n/a nM
Citation Hrast, MSosic, ISink, RGobec, S Inhibitors of the peptidoglycan biosynthesis enzymes MurA-F. Bioorg Chem55:2-15 (2014) 
 
UDP-N-acetylmuramoylalanine--D-glutamate ligase
Name:UDP-N-acetylmuramoylalanine--D-glutamate ligase
Type:Ligase
Mol. Mass.:46963.02
Organism:Escherichia coli (strain K12)
Description:n/a
Residue:438
BDBM119104
NameBDBM119104
Synonyms:MurD inhibitor (compound 46)
TypeSmall organic molecule
Emp. Form.C26H23N3O9S2
Mol. Mass.585.606
SMILESOC(=O)CC[C@@H](NC(=O)c1cccc(CN(C(=O)CC(O)=O)c2ccc(C=C3SC(S)=NC3=O)cc2)c1)C(O)=O