Reaction Details
TargetUDP-N-acetylmuramoyl-tripeptide--D-alanyl-D-alanine ligase
LigandBDBM119114
Substrate/Competitorn/a
IC50 22±0.0 nM
Citation Hrast, MSosic, ISink, RGobec, S Inhibitors of the peptidoglycan biosynthesis enzymes MurA-F. Bioorg Chem55:2-15 (2014) 
 
UDP-N-acetylmuramoyl-tripeptide--D-alanyl-D-alanine ligase
Name:UDP-N-acetylmuramoyl-tripeptide--D-alanyl-D-alanine ligase
Type:Protein
Mol. Mass.:47439.03
Organism:Escherichia coli
Description:P11880
Residue:452
BDBM119114
NameBDBM119114
Synonyms:MurF inhibitor (compound 56)
TypeSmall organic molecule
Emp. Form.C26H25Cl2N3O5S2
Mol. Mass.594.53
SMILESOc1ccc(cc1)[C@@H]1CCC2C(C1)SC(NC(=O)c1cc(c(Cl)cc1Cl)S(=O)(=O)N1CCOCC1)=C2C#N