Reaction Details
TargetUDP-N-acetylmuramoyl-tripeptide--D-alanyl-D-alanine ligase
LigandBDBM119121
Substrate/Competitorn/a
IC50 2.9e+4±n/a nM
Citation Hrast, MSosic, ISink, RGobec, S Inhibitors of the peptidoglycan biosynthesis enzymes MurA-F. Bioorg Chem55:2-15 (2014) 
 
UDP-N-acetylmuramoyl-tripeptide--D-alanyl-D-alanine ligase
Name:UDP-N-acetylmuramoyl-tripeptide--D-alanyl-D-alanine ligase
Type:Protein
Mol. Mass.:47439.03
Organism:Escherichia coli
Description:P11880
Residue:452
BDBM119121
NameBDBM119121
Synonyms:MurF inhibitor (compound 63)
TypeSmall organic molecule
Emp. Form.C31H36N2O3
Mol. Mass.484.6291
SMILESCOc1ccc2nc(OC)c(cc2c1)[C@@H](c1ccccc1)[C@@](O)(CCN(C)C)CCc1ccccc1