Reaction Details
TargetUDP-N-acetylglucosamine 1-carboxyvinyltransferase
LigandBDBM119122
Substrate/Competitorn/a
IC50 3.9e+4±n/a nM
Citation Hrast, MSosic, ISink, RGobec, S Inhibitors of the peptidoglycan biosynthesis enzymes MurA-F. Bioorg Chem55:2-15 (2014) 
 
UDP-N-acetylglucosamine 1-carboxyvinyltransferase
Name:UDP-N-acetylglucosamine 1-carboxyvinyltransferase
Type:Protein
Mol. Mass.:44814.62
Organism:Escherichia coli K-12 (Enterobacteria)
Description:E. coli MurA
Residue:419
BDBM119122
NameBDBM119122
Synonyms:MurA/B/C/D/E inhibitor (compound 67)
TypeSmall organic molecule
Emp. Form.C22H13F3O3
Mol. Mass.382.332
SMILESFC(F)(F)c1ccc(cc1)C1C(=O)OC(=Cc2cccc3ccccc23)C1=O