Reaction Details
TargetUDP-N-acetylmuramoylalanine--D-glutamate ligase
LigandBDBM119122
Substrate/Competitorn/a
IC50 1.3e+4±n/a nM
Citation Hrast, MSosic, ISink, RGobec, S Inhibitors of the peptidoglycan biosynthesis enzymes MurA-F. Bioorg Chem55:2-15 (2014) 
 
UDP-N-acetylmuramoylalanine--D-glutamate ligase
Name:UDP-N-acetylmuramoylalanine--D-glutamate ligase
Type:Protein
Mol. Mass.:49837.61
Organism:Staphylococcus aureus (Firmicutes)
Description:S. aureus MurD
Residue:449
BDBM119122
NameBDBM119122
Synonyms:MurA/B/C/D/E inhibitor (compound 67)
TypeSmall organic molecule
Emp. Form.C22H13F3O3
Mol. Mass.382.332
SMILESFC(F)(F)c1ccc(cc1)C1C(=O)OC(=Cc2cccc3ccccc23)C1=O