Reaction Details
TargetUDP-N-acetylmuramoyl-tripeptide--D-alanyl-D-alanine ligase
LigandBDBM85276
Substrate/Competitorn/a
IC50 2.40e+5±n/a nM
Citation Hrast, MSosic, ISink, RGobec, S Inhibitors of the peptidoglycan biosynthesis enzymes MurA-F. Bioorg Chem55:2-15 (2014) 
 
UDP-N-acetylmuramoyl-tripeptide--D-alanyl-D-alanine ligase
Name:UDP-N-acetylmuramoyl-tripeptide--D-alanyl-D-alanine ligase
Type:Protein
Mol. Mass.:47439.03
Organism:Escherichia coli
Description:P11880
Residue:452
BDBM85276
NameBDBM85276
Synonyms:HEA derivative, 7c | MurC/D/E/F inhibitor (compound 68)
TypeSmall organic molecule
Emp. Form.C14H20F3N2O7PS
Mol. Mass.448.352
SMILESOP(O)(=O)OC(CNS(=O)(=O)c1ccc(cc1)C(F)(F)F)CN1CCOCC1