Reaction Details
TargetDNA-(apurinic or apyrimidinic site) endonuclease
LigandBDBM50303955
Substrate/Competitorn/a
Meas. Tech.Electrophoretic Mobility Shift Assays (EMSAs)
pH7.5±n/a
IC50 2.0e+4±n/a nM
Commentsextracted
Citation Zhang, JLuo, MMarasco, DLogsdon, DLaFavers, KAChen, QReed, AKelley, MRGross, MLGeorgiadis, MM Inhibition of apurinic/apyrimidinic endonuclease I's redox activity revisited. Biochemistry52:2955-66 (2013) 
 
DNA-(apurinic or apyrimidinic site) endonuclease
Name:DNA-(apurinic or apyrimidinic site) endonuclease
Type:Protein
Mol. Mass.:35560.12
Organism:Homo sapiens (Human)
Description:P27695
Residue:318
BDBM50303955
NameBDBM50303955
Synonyms:(E)-3-(5,6-Dimethoxy-3-methyl-14-dioxocyclohexa-25-dienyl)-2-nonylpropenoic Acid E3330 | US9624235, Compound E3330
TypeSmall organic molecule
Emp. Form.C21H30O6
Mol. Mass.378.4593
SMILESCCCCCCCCCC(=CC1=C(C)C(=O)C(OC)=C(OC)C1=O)C(O)=O