Reaction Details
TargetEnoyl-acyl carrier reductase ENR
LigandBDBM119865
Substrate/Competitorn/a
Meas. Tech.TgENR Inhibition Assay
pH7.5±n/a
IC50 18±0.0 nM
Commentsextracted
Citation Afanador, GAMuench, SPMcPhillie, MFomovska, ASchön, ASchön, YCheng, GStec, JFreundlich, JSShieh, HMAnderson, JWJacobus, DPFidock, DAKozikowski, APFishwick, CWRice, DWFreire, EMcLeod, RPrigge, ST Discrimination of potent inhibitors of Toxoplasma gondii enoyl-acyl carrier protein reductase by a thermal shift assay. Biochemistry52:9155-66 (2013) 
 
Enoyl-acyl carrier reductase ENR
Name:Enoyl-acyl carrier reductase ENR
Type:PROTEIN
Mol. Mass.:43663.67
Organism:Toxoplasma gondii
Description:ChEMBL_1290812
Residue:417
BDBM119865
NameBDBM119865
Synonyms:6‐chloro‐3‐(2,4‐dichlorophenoxy)‐2‐ hydroxybenzonitrile (15)
TypeSmall organic molecule
Emp. Form.C13H6Cl3NO2
Mol. Mass.314.551
SMILESOc1c(Oc2ccc(Cl)cc2Cl)ccc(Cl)c1C#N