Reaction Details
TargetMitogen-activated protein kinase 1
LigandBDBM120092
Substrate/Competitorn/a
Meas. Tech.Enzymatic Assay
pH7.3±n/a
IC50 15.6±n/a nM
Commentsextracted
Citation Blake, JFChicarelli, MJGarrey, RFGaudino, JGrina, JMoreno, DAMohr, PJRen, LSchwarz, JChen, HRobarge, KZhou, A Serine/threonine kinase inhibitors US Patent US8697715 Publication Date 4/15/2014
 
Mitogen-activated protein kinase 1
Name:Mitogen-activated protein kinase 1
Type:Ser/Thr Protein Kinase
Mol. Mass.:41392.76
Organism:Homo sapiens (Human)
Description:P28482
Residue:360
BDBM120092
NameBDBM120092
Synonyms:US8697715, 14 | US9259470, 14
TypeSmall organic molecule
Emp. Form.C21H21ClFN5O3
Mol. Mass.445.875
SMILESOCC(c1ccc(Cl)c(F)c1)n1ccc(nc1=O)-c1ccnc(NC2CCOCC2)n1