Reaction Details
TargetStromelysin-2
LigandBDBM120160
Substrate/Competitorn/a
Meas. Tech.Inhibition Assay
Ki 35±n/a nM
Citation Devel, LBeau, FCzarny, BDive, V Pseudodipeptides as MMP inhibitors US Patent US8691753 Publication Date 4/8/2014
 
Stromelysin-2
Name:Stromelysin-2
Type:Enzyme
Mol. Mass.:54143.02
Organism:Homo sapiens (Human)
Description:P09238
Residue:476
BDBM120160
NameBDBM120160
Synonyms:US8691753, 8
TypeSmall organic molecule
Emp. Form.C27H27ClN4O8
Mol. Mass.570.978
SMILESNC(=O)[C@H](CC(O)=O)NC(=O)[C@H](CCC(O)=O)NC(=O)CCc1cc(no1)-c1ccc(cc1)-c1cccc(Cl)c1