Reaction Details
TargetStromelysin-2
LigandBDBM120170
Substrate/Competitorn/a
Meas. Tech.Inhibition Assay
Ki 196±n/a nM
Citation Devel, LBeau, FCzarny, BDive, V Pseudodipeptides as MMP inhibitors US Patent US8691753 Publication Date 4/8/2014
 
Stromelysin-2
Name:Stromelysin-2
Type:Enzyme
Mol. Mass.:54143.02
Organism:Homo sapiens (Human)
Description:P09238
Residue:476
BDBM120170
NameBDBM120170
Synonyms:US8691753, 18
TypeSmall organic molecule
Emp. Form.C26H28N4O6
Mol. Mass.492.5237
SMILESCC[C@H](NC(=O)CCc1cc(no1)-c1ccc(cc1)-c1ccccc1)C(=O)N[C@@H](CC(O)=O)C(N)=O