Reaction Details
TargetStromelysin-2
LigandBDBM120175
Substrate/Competitorn/a
Meas. Tech.Inhibition Assay
Ki 276±n/a nM
Citation Devel, LBeau, FCzarny, BDive, V Pseudodipeptides as MMP inhibitors US Patent US8691753 Publication Date 4/8/2014
 
Stromelysin-2
Name:Stromelysin-2
Type:Enzyme
Mol. Mass.:54143.02
Organism:Homo sapiens (Human)
Description:P09238
Residue:476
BDBM120175
NameBDBM120175
Synonyms:US8691753, 23
TypeSmall organic molecule
Emp. Form.C26H28N4O6
Mol. Mass.492.5237
SMILESC[C@H](NC(=O)[C@H](CCC(O)=O)NC(=O)CCc1cc(no1)-c1ccc(cc1)-c1ccccc1)C(N)=O