Reaction Details
TargetStromelysin-2
LigandBDBM120203
Substrate/Competitorn/a
Meas. Tech.Inhibition Assay
Ki 433±n/a nM
Citation Devel, LBeau, FCzarny, BDive, V Pseudodipeptides as MMP inhibitors US Patent US8691753 Publication Date 4/8/2014
 
Stromelysin-2
Name:Stromelysin-2
Type:Enzyme
Mol. Mass.:54143.02
Organism:Homo sapiens (Human)
Description:P09238
Residue:476
BDBM120203
NameBDBM120203
Synonyms:US8691753, 52
TypeSmall organic molecule
Emp. Form.C28H28N2O6
Mol. Mass.488.5317
SMILESOC(=O)CC[C@H](NC(=O)CCc1ccc(cc1)-c1ccccc1)C(=O)Nc1cccc(CC(O)=O)c1