Reaction Details
TargetStromelysin-2
LigandBDBM120235
Substrate/Competitorn/a
Meas. Tech.Inhibition Assay
Ki 514±n/a nM
Citation Devel, LBeau, FCzarny, BDive, V Pseudodipeptides as MMP inhibitors US Patent US8691753 Publication Date 4/8/2014
 
Stromelysin-2
Name:Stromelysin-2
Type:Enzyme
Mol. Mass.:54143.02
Organism:Homo sapiens (Human)
Description:P09238
Residue:476
BDBM120235
NameBDBM120235
Synonyms:US8691753, 84
TypeSmall organic molecule
Emp. Form.C27H29N3O6S
Mol. Mass.523.601
SMILESNC(=O)[C@H](Cc1ccc(O)cc1)NC(=O)[C@H](CCC(O)=O)NC(=O)CCc1ccc(cc1)-c1cccs1