Reaction Details
TargetStromelysin-2
LigandBDBM120256
Substrate/Competitorn/a
Meas. Tech.Inhibition Assay
Ki 318±n/a nM
Citation Devel, LBeau, FCzarny, BDive, V Pseudodipeptides as MMP inhibitors US Patent US8691753 Publication Date 4/8/2014
 
Stromelysin-2
Name:Stromelysin-2
Type:Enzyme
Mol. Mass.:54143.02
Organism:Homo sapiens (Human)
Description:P09238
Residue:476
BDBM120256
NameBDBM120256
Synonyms:US8691753, 106
TypeSmall organic molecule
Emp. Form.C32H30N2O6S
Mol. Mass.570.655
SMILESOC(=O)CC[C@H](NC(=O)CCc1ccc(cc1)-c1cc(cs1)-c1ccccc1)C(=O)Nc1cccc(CC(O)=O)c1